Notification messages shown when software fails.

learn more… | top users | synonyms

2
votes
0answers
38 views

Geometry issues when digitising in QGIS

I'm digitising a large number of maps from hand drawn mud maps and digital images, and although I have used the snapping tools ("snap to vertex and segment", Tolerance 10 pixels, avoid intersections) ...
0
votes
0answers
44 views

ArcScene projection error

I using WGS84 coordinate system in my project. If I will export web scene, arcscene give this error; 000269 : The cartographic spatial reference does not have a projected coordinate system. ...
0
votes
1answer
52 views

QGIS Processing Plugin Not Loading “RuntimeError: maximum recursion depth exceeded in cmp”

I am having serious issues with my QGIS program regarding the Processing Plugin. Upon start-up and if I turn on the plugin within the program. I have uninstalled and reinstalled the program. Have ...
0
votes
0answers
34 views

Error “one or more activex controls could not be . . . .”

I'm using ArcGIS 10.2.2. I can open ArcGIS 10.2.2 help. After selecting search option, I've encountered this error: one or more activex controls could not be displayed because either: 1) your ...
0
votes
0answers
44 views

Problem with Geonode Create Map error 403

I have installed Geonode 2.4 (developer version) on Ubuntu 14 and all is doing fine. However, the last few days I am getting an error message whenever I try to "create map". The error message is: ...
1
vote
1answer
65 views

MCC-LiDAR error: version minor out of range

I am trying to use MCC-LiDAR tool, but I can't get it to work. Example, when I type: C:\>mcc-lidar -s 1 -t 1 TMR_428_63.las output_filename.las I get the following error message: Internal ...
1
vote
0answers
118 views

QGIS 2.10 crashes while working with Qgis2web plugin

Currently I am working on Qgis2Web for editing and generating web maps from my vector data. But after opening the plug in window. QGIS got crashed.
0
votes
1answer
195 views

Unknown Error? - A Column was specified that does not exist

shps = [(shp1,"field1"), (shp2,"field2")] for item in shps: shp = item[0] field = item[1] for row in arcpy.SearchCursor(shp, fields='"{0}"'.format(field)): if row == ...
1
vote
3answers
146 views

Python says my shapefile does not exist. Why?

I'm working on a script that prints the names of hospitals that are within a certain zip-code. When I run my code, though, python keeps giving me an Error message that says that my Hospitals shapefile ...
0
votes
0answers
38 views

ZeroDivisionError

I was conducting Mean Coodinates process functions with weighted fields when I began faces ZeroDivision errors in some processes. The Shapefile Data has been joined together with imported Spreadsheet ...
0
votes
0answers
70 views

Unable to get property 'parse' of undefined or null reference error in building Windows Forum Application in C# by Visual Studio 2010

I am trying to build a Windows Forum Application that will uses to download and display some layer in the Geoserver. But every time that I run the app I will see an error(image). Can anybody help me ...
1
vote
2answers
40 views

Convert time field omitting time and returning null values

I have a time field in my shapefile that is formatted as HH:mm:ss.s It is a text field, and I want to convert it to a date so I can calculate time elapsed across rows (if there's a better way to do ...
1
vote
2answers
102 views

Cartodb - Error: sql is read-only in NamedMaps

My map is not a named map. Map privacy is set to only people with the link. Why I I getting this error when trying to do queries? Has anyone else run into this?
0
votes
2answers
179 views

qgis2web python error message

Some times qgis2web pluggin does not work. I have this python error message: Ha ocurrido un error mientras se ejecutaba el código de Python: Traceback (most recent call last): File ...
1
vote
0answers
35 views

QGIS 2.8.1 running error

I am using QGIS 2.8.1-wein 32bin version. When running QGIS, It does not open. After displaying like below the picture, nothing happen. If you can solve this problem, please give me a solution. (I ...
2
votes
0answers
86 views

Data Upload Error for QGIS Cloud

I'm just taking a stab at QGIS Cloud to investigate it for a potential client, and I am pleased with the functionality of the web-viewer based on the sample maps. Although I cannot upload my own data. ...
0
votes
0answers
17 views

QGIS: “Attribute index out of bounds” error when hiding fields and using Actions

I have a long table with autoincrementing fields that the user doesn't need to see. I changed them to "hidden" through the field attribute editor. The problem is that I'm also using Actions (a ...
1
vote
1answer
55 views

ArcGIS Toolbox functions missing all parameters?

I recently installed ArcGIS 10.3.1 and now all the toolbox functions (that I have tried) open, but they have no parameter fields. For example, the "Add Field" tool comes up with the standard toolox ...
3
votes
1answer
36 views

PostGIS - interfacing with CADCORP 7.1 and QGIS - user 'postgres' can import, but no other roles can

I'm new to PostGIS (reasonably) - but I'm plagued with one on-going problem: I'm able to access PostGIS from various GIS systems using the main 'postgres' user. Using a newly created user ...
0
votes
0answers
73 views

ArcGIS Desktop: Not Rendering Line Data but Web Service Outputs Fine

I have some script which read .JSON files through .NET and then inserts the data into a SQL Server database. The data's Geometry is of the type esriGeometryPolyline ; basically, they are floor plans ...
0
votes
1answer
127 views

TypeError: value #0 - unsupported type: datetime.timedelta

The following code runs fine minus receiving the error below, which doesn't make any sense (to me) as I have other UpdateCursors and perform UpdateRow(row) with other date values. As can be seen ...
0
votes
1answer
18 views

Hub Distance - 'Layer not found'

I am trying to calculate the distance between a polyline (River) and multiple points. However after installing the MMQGIS plugin and running a Hub Distance between the two layers the error comes up ...
0
votes
0answers
130 views

KMZ from QGIS wont display in Android Google Earth - Raster Images?

Trying to get a kmz working in the google earth android app.. works fine on google earth desktop.. I think maybe its because it has images in it? Any ideas? Error I get is Error: 1 Parse Error ...
0
votes
0answers
12 views

Cannot Load Object - Region object type is not supported in this table. Operation canceled

I have linked an Access Database with MapInfo and created a mappable tab. However I am unable to populate the table with any regions/polygons/poly lines etc. It says "Cannot Load Object - Region ...
1
vote
1answer
108 views

Error executing kriging in modelbuilder: 'invalid output extent'

I'm doing an interpolation using kriging in Modelbuilder, my model is this: Every time I run the model it says: ERROR 010092: Invalid output extent. Failed to execute (Kriging). Why does this ...
0
votes
1answer
29 views

Growing error from west to east when overlaying raster and shape

I am using a shape of Austria from gadm.org which I want to overlay with a netCDF file in R. As the netCDF has projected coordinates in EPSG:31287, I have reprojected the shape using FWtools and the ...
2
votes
1answer
189 views

How to open a “.sos” file without crashing QGIS?

I am trying to open a ".sos" file in QGIS. I have QGIS installed using OSGeo4W and added the gdal-sosi package. This should do the trick. But QGIS just shuts down when I try to open the file. It ...
-4
votes
1answer
198 views

Handling ArcPy locks in Python script?

i am writing script which uses different Tools of arcgis and implementing different functionalities .. My script consists in different Functions running in an order. Each function is connected to ...
1
vote
1answer
55 views

ArcMap shutting down when I add rasters to a mosaic in foreground processing

I'm trying to add rasters to a mosaic - I was initially trying to do this by background processing but I was receiveing an error - I've followed the advice of this article ...
0
votes
0answers
52 views

Is this error “invalid context…fatal error” due to GRASS GIS bug or the system?

Copy of error message that appears in the terminal (Macbook Pro, OS X 10.9.5): MacBook-Pro.local Python[2653] :CGContextRestoreGState: invalid context 0x0. This is a serious error. This ...
2
votes
1answer
269 views

What does number of shapes does not match the number of table records mean when trying to repair a data source?

I'm trying to repair a data source on arc from a .shp file. Every time I match it with the correct .shp file it display an error message stating "Number of shapes does not match the number of record ...
1
vote
0answers
244 views

Error when exporting individual pages from ArcGIS DDP

I'm working with a 52 page map book using data driven pages. I have used this before and haven't had any issues but I am currently getting an error message when I try and export individual pages. I ...
0
votes
1answer
118 views

Debugging AttributeError: 'Result' object has no attribute 'save' from ArcPy script?

I Keep getting this error message when i run the code below, can anyone tell me why? Error message: Traceback (most recent call last): File ...
0
votes
0answers
81 views

Qgis 2.8, gdal python scripts gives error at end of process

I am using Qgis 2.8.1 64-bit (Standalone installer) which also packages a number or other applications, like OSGeo4W Shell, Saga GIS et.c. In the OSGeo4W Shell I am encountering a problem with some ...
2
votes
1answer
117 views

Error 4 in rasterizing a polygon shapefile

I'm using QGIS Wien 2.8.1 trying to convert a polygon shapefile to a raster, but I get the following error in a qgis-bin pop-up: ERROR 4: `' does not exist in the file system, and is not recognised ...
0
votes
0answers
263 views

java.lang.IllegalStateException: Form too large 326482>200000

I have a problem with Geoserver style creator! When I want upload a SLD file that I create it by QGIS I will see this error! Geoserver 2.6-SNAPSHOT, QGIS 2.8 HTTP ERROR 500 Problem accessing ...
2
votes
1answer
162 views

Unable to compile using make test in Linux

While trying to compile my test plugin I encounter this error, for the moment I can't figure out why, last week I had some issues on windows but eventually solved them via OSGeo Shell but this time ...
1
vote
2answers
188 views

Python Crashes when Running ArcPy's ExportToPDF(), ExportToPNG(), ExportToJPEG()

I am attempting to loop through a folder of ~400 .mxd's and save each to a .pdf in another folder. All tested arcpy.mapping export functions (pdf, jpeg & png) kill python without a chance to ...
0
votes
1answer
56 views

TopologyException error during fortify SpatialPolygonsDataFrame

I tried to reproduce a recent question on spatial data visualization using ggplot2 and received the following error message during fortify(world, region = "ISO3"): Error: TopologyException: Input ...
2
votes
1answer
143 views

Gdal_calc works but I get a pyhon error at the end of each process

I have a problem while using gdal_calc by a .bat file. Here is the code : call "C:\OSGeo4w64\bin\o4w_env.bat" gdal_calc ...
1
vote
2answers
230 views

In-line variable %Name% problem in Model Builder

Having a problem with the inline variable structure of %Name%. Attached is my model builder program. I want to be able to take the Name of the file (which is produced as a variable in the iterate ...
3
votes
1answer
382 views

Processing plugin Python error on startup of QGIS 2.8.1

I've been running QGIS with no issues for several versions now, but after I upgraded to 2.8.1 Wien I had trouble running two plugins: qgis2leaf (which I believe depends on Processing) and Processing. ...
1
vote
0answers
102 views

Suppress verbose output when something goes wrong with ogr2ogr

Whenever ogr2ogr is not able to read a file, it seems to produce pages of output: Unable to open datasource `file.geojson' with the following drivers. -> ESRI Shapefile -> MapInfo File ...
0
votes
0answers
65 views

Failed to create feature dataset error

I am trying to create a feature dataset in a FILEGDB to create topology rules. However when I try to create a dataset it gives me this error. Failed to create the feature dataset. FDO error: ...
0
votes
1answer
81 views

Python error in search cursor function

I need to access the dbf file to extract variable list (i.e. "CODE"). Basically I am calling dbf file to allMamrows variable and then I am appending using for loop. On running the script I am getting ...
0
votes
0answers
60 views

qgis raster calculator unexpected type long

I am trying to do a very simple multiplication of a raster using the QGIS raster calculator but repeatedly receive the following error: Traceback (most recent call last): File ...
1
vote
2answers
69 views

QGIS GEarthView plugin ReactorAlreadyInstalledError

I've been battling to get this really handy plugin working for some time. When I try installing it from plugin manager, I get the following error: "This plugin is broken 'module' object has no ...
0
votes
0answers
67 views

Is Images Concatenation in the Processing toolbox working in QGIS 2.8?

I want to make a single multiband .tiff image out of 7 bands that I have downloaded from USGS Earth Explorer and for that I used images concatination in the processing toolbox. I have loaded the 7 ...
0
votes
0answers
79 views

How to add vector layer in Open Geo Suite?

Plugin for the add vector layer:- OpenLayers.Layer.Vector = OpenLayers.Class(OpenLayers.Layer, { isBaseLayer: !1, isFixed: !1, features: null, filter: null, selectedFeatures: null, ...
0
votes
0answers
47 views

Command Grass in QGIS not work

When I use r.contour or other Grass commands in QGis, I have this error message. Why?