Notification messages shown when software fails.

learn more… | top users | synonyms

1
vote
1answer
1k views

Fill sinks error in arcHydro

I am working on a project that is modeling runoff at a county level. The DEM used is lidar derived and has a 5 ft resolution. The general workflow I am flowing is Sink evaluation Sink Selection (to ...
1
vote
2answers
102 views

Cartodb - Error: sql is read-only in NamedMaps

My map is not a named map. Map privacy is set to only people with the link. Why I I getting this error when trying to do queries? Has anyone else run into this?
0
votes
2answers
179 views

qgis2web python error message

Some times qgis2web pluggin does not work. I have this python error message: Ha ocurrido un error mientras se ejecutaba el código de Python: Traceback (most recent call last): File ...
1
vote
0answers
2k views

Failed to Connect to database: Underlying database error occured

I'm trying to connect to a personal database in ArcGIS 10.2 that contains work that I've spent the last two weeks working on but I am now receiving an error: Failed to connect to database. An ...
1
vote
1answer
55 views

ArcGIS Toolbox functions missing all parameters?

I recently installed ArcGIS 10.3.1 and now all the toolbox functions (that I have tried) open, but they have no parameter fields. For example, the "Add Field" tool comes up with the standard toolox ...
1
vote
0answers
35 views

QGIS 2.8.1 running error

I am using QGIS 2.8.1-wein 32bin version. When running QGIS, It does not open. After displaying like below the picture, nothing happen. If you can solve this problem, please give me a solution. (I ...
2
votes
0answers
86 views

Data Upload Error for QGIS Cloud

I'm just taking a stab at QGIS Cloud to investigate it for a potential client, and I am pleased with the functionality of the web-viewer based on the sample maps. Although I cannot upload my own data. ...
0
votes
0answers
17 views

QGIS: “Attribute index out of bounds” error when hiding fields and using Actions

I have a long table with autoincrementing fields that the user doesn't need to see. I changed them to "hidden" through the field attribute editor. The problem is that I'm also using Actions (a ...
2
votes
2answers
322 views

QGIS installation from OSGeoW4: entry point not found in qgis_core.dll

I have installed QGIS through OSGeo4W installation. My operation system is windows 7 64x. I try to start the program QGIS Desktop from start menu this error: Do I need to do something? Installation ...
0
votes
0answers
73 views

ArcGIS Desktop: Not Rendering Line Data but Web Service Outputs Fine

I have some script which read .JSON files through .NET and then inserts the data into a SQL Server database. The data's Geometry is of the type esriGeometryPolyline ; basically, they are floor plans ...
-4
votes
1answer
198 views

Handling ArcPy locks in Python script?

i am writing script which uses different Tools of arcgis and implementing different functionalities .. My script consists in different Functions running in an order. Each function is connected to ...
3
votes
1answer
36 views

PostGIS - interfacing with CADCORP 7.1 and QGIS - user 'postgres' can import, but no other roles can

I'm new to PostGIS (reasonably) - but I'm plagued with one on-going problem: I'm able to access PostGIS from various GIS systems using the main 'postgres' user. Using a newly created user ...
5
votes
3answers
35k views

How to fix Runtime Error R6034: An application has made an attempt to load th C runtime library incorrectly?

I just downloaded QGIS 2.0 and everytime I open it I get this error message window popping up: Does anyone know what this means or how I might be able to fix it? Thanks!
0
votes
1answer
127 views

TypeError: value #0 - unsupported type: datetime.timedelta

The following code runs fine minus receiving the error below, which doesn't make any sense (to me) as I have other UpdateCursors and perform UpdateRow(row) with other date values. As can be seen ...
0
votes
1answer
18 views

Hub Distance - 'Layer not found'

I am trying to calculate the distance between a polyline (River) and multiple points. However after installing the MMQGIS plugin and running a Hub Distance between the two layers the error comes up ...
0
votes
0answers
131 views

KMZ from QGIS wont display in Android Google Earth - Raster Images?

Trying to get a kmz working in the google earth android app.. works fine on google earth desktop.. I think maybe its because it has images in it? Any ideas? Error I get is Error: 1 Parse Error ...
0
votes
0answers
12 views

Cannot Load Object - Region object type is not supported in this table. Operation canceled

I have linked an Access Database with MapInfo and created a mappable tab. However I am unable to populate the table with any regions/polygons/poly lines etc. It says "Cannot Load Object - Region ...
3
votes
3answers
2k views

Problem operating LAStools in QGIS 2.6.1

I have a problem with LAStools in QGIS 2.6.1. I have never used QGIS to process LiDAR data before. I downloaded LAStools yesterday from the rapidlasso GmbH website. I unzipped the “lastools.zip” ...
2
votes
1answer
190 views

How to open a “.sos” file without crashing QGIS?

I am trying to open a ".sos" file in QGIS. I have QGIS installed using OSGeo4W and added the gdal-sosi package. This should do the trick. But QGIS just shuts down when I try to open the file. It ...
0
votes
1answer
29 views

Growing error from west to east when overlaying raster and shape

I am using a shape of Austria from gadm.org which I want to overlay with a netCDF file in R. As the netCDF has projected coordinates in EPSG:31287, I have reprojected the shape using FWtools and the ...
1
vote
1answer
55 views

ArcMap shutting down when I add rasters to a mosaic in foreground processing

I'm trying to add rasters to a mosaic - I was initially trying to do this by background processing but I was receiveing an error - I've followed the advice of this article ...
2
votes
2answers
3k views

Qgis - Couldn't load plugin 'processing' - name 'QsciLexerCustom' is not defined - Manjaro

UPDATED I receive the following error when I start Qgis: Couldn't load plugin 'processing' from ['/usr/share/qgis/python', '/home/v/.qgis2/python', '/home/v/.qgis2/python/plugins', ...
1
vote
2answers
176 views

How to avoid snapping errors in QGis?

I am using QGis version 2.2.0 and I set the snapping option to the vertex, with a tolerance of 1.5 meter. When I draw a new polygon next to an old one, it seems like the vertices are automatically ...
5
votes
2answers
529 views

Skip errors in ModelBuilder?

is there a way to handle an error within the ArcGIS ModelBuilder? I have a model which iterates over hundreds of raster files. some of them may be corrupt. i`m looking for a way in which the ...
0
votes
0answers
52 views

Is this error “invalid context…fatal error” due to GRASS GIS bug or the system?

Copy of error message that appears in the terminal (Macbook Pro, OS X 10.9.5): MacBook-Pro.local Python[2653] :CGContextRestoreGState: invalid context 0x0. This is a serious error. This ...
2
votes
1answer
270 views

What does number of shapes does not match the number of table records mean when trying to repair a data source?

I'm trying to repair a data source on arc from a .shp file. Every time I match it with the correct .shp file it display an error message stating "Number of shapes does not match the number of record ...
0
votes
1answer
118 views

Debugging AttributeError: 'Result' object has no attribute 'save' from ArcPy script?

I Keep getting this error message when i run the code below, can anyone tell me why? Error message: Traceback (most recent call last): File ...
2
votes
1answer
117 views

Error 4 in rasterizing a polygon shapefile

I'm using QGIS Wien 2.8.1 trying to convert a polygon shapefile to a raster, but I get the following error in a qgis-bin pop-up: ERROR 4: `' does not exist in the file system, and is not recognised ...
0
votes
0answers
81 views

Qgis 2.8, gdal python scripts gives error at end of process

I am using Qgis 2.8.1 64-bit (Standalone installer) which also packages a number or other applications, like OSGeo4W Shell, Saga GIS et.c. In the OSGeo4W Shell I am encountering a problem with some ...
2
votes
1answer
162 views

Unable to compile using make test in Linux

While trying to compile my test plugin I encounter this error, for the moment I can't figure out why, last week I had some issues on windows but eventually solved them via OSGeo Shell but this time ...
0
votes
0answers
263 views

java.lang.IllegalStateException: Form too large 326482>200000

I have a problem with Geoserver style creator! When I want upload a SLD file that I create it by QGIS I will see this error! Geoserver 2.6-SNAPSHOT, QGIS 2.8 HTTP ERROR 500 Problem accessing ...
0
votes
1answer
556 views

How to upload a list of 5-digit zip codes to CartoDB?

I'm playing around with the free version of CartoDB right now. Trying to upload both a CSV and Excel document with a list of 5-digit zip codes. I have received a "there was a problem georeferencing ...
3
votes
1answer
382 views

Processing plugin Python error on startup of QGIS 2.8.1

I've been running QGIS with no issues for several versions now, but after I upgraded to 2.8.1 Wien I had trouble running two plugins: qgis2leaf (which I believe depends on Processing) and Processing. ...
1
vote
2answers
189 views

Python Crashes when Running ArcPy's ExportToPDF(), ExportToPNG(), ExportToJPEG()

I am attempting to loop through a folder of ~400 .mxd's and save each to a .pdf in another folder. All tested arcpy.mapping export functions (pdf, jpeg & png) kill python without a chance to ...
0
votes
1answer
56 views

TopologyException error during fortify SpatialPolygonsDataFrame

I tried to reproduce a recent question on spatial data visualization using ggplot2 and received the following error message during fortify(world, region = "ISO3"): Error: TopologyException: Input ...
2
votes
1answer
143 views

Gdal_calc works but I get a pyhon error at the end of each process

I have a problem while using gdal_calc by a .bat file. Here is the code : call "C:\OSGeo4w64\bin\o4w_env.bat" gdal_calc ...
3
votes
2answers
10k views

How to fix python ImportError: DLL load failed: The specified module could not be found?

During import fiona, I am getting following error. Error is different from other user so I asked this question may be it is repeated. import fiona Traceback (most recent call last): File ...
1
vote
2answers
271 views

Can't compile plugin builder plugin in QGIS 2.4 (Windows)

I'm trying to build a basic plugin using plugin builder but I can't even compile it. I tried following a few tutorials and just trying to compile whatever but that always results in the same problem. ...
1
vote
2answers
231 views

In-line variable %Name% problem in Model Builder

Having a problem with the inline variable structure of %Name%. Attached is my model builder program. I want to be able to take the Name of the file (which is produced as a variable in the iterate ...
2
votes
1answer
128 views

Are latitude and longitude observations independent of each other or correlated?

I want to develop a bivariate gaussian kernel in order to handle the random noise in my GPS tracks where each point has three parameters (lat, long and time stamp). I was wondering if latitude and ...
1
vote
0answers
102 views

Suppress verbose output when something goes wrong with ogr2ogr

Whenever ogr2ogr is not able to read a file, it seems to produce pages of output: Unable to open datasource `file.geojson' with the following drivers. -> ESRI Shapefile -> MapInfo File ...
0
votes
0answers
65 views

Failed to create feature dataset error

I am trying to create a feature dataset in a FILEGDB to create topology rules. However when I try to create a dataset it gives me this error. Failed to create the feature dataset. FDO error: ...
1
vote
1answer
189 views

GeoDjango error: Only numeric values of degree units are allowed on geographic DWithin queries

I'm trying to get N points within 5000 meters of a certain point. My database is Postgres(PostGIS). I have a model like this: class Theatre(models.Model): geom = models.PointField(srid=4326, ...
1
vote
3answers
158 views

Why do I get an error message at QGIS training manual 3.3?

I have a problem following the QGIS training manual lesson 3.3 (Ratio Classification). You have to add a column to an SQlite layer. The new column is AREA. I followed the instructions and added it as ...
0
votes
1answer
81 views

Python error in search cursor function

I need to access the dbf file to extract variable list (i.e. "CODE"). Basically I am calling dbf file to allMamrows variable and then I am appending using for loop. On running the script I am getting ...
0
votes
0answers
60 views

qgis raster calculator unexpected type long

I am trying to do a very simple multiplication of a raster using the QGIS raster calculator but repeatedly receive the following error: Traceback (most recent call last): File ...
0
votes
0answers
67 views

Is Images Concatenation in the Processing toolbox working in QGIS 2.8?

I want to make a single multiband .tiff image out of 7 bands that I have downloaded from USGS Earth Explorer and for that I used images concatination in the processing toolbox. I have loaded the 7 ...
0
votes
0answers
79 views

How to add vector layer in Open Geo Suite?

Plugin for the add vector layer:- OpenLayers.Layer.Vector = OpenLayers.Class(OpenLayers.Layer, { isBaseLayer: !1, isFixed: !1, features: null, filter: null, selectedFeatures: null, ...
0
votes
0answers
47 views

Command Grass in QGIS not work

When I use r.contour or other Grass commands in QGis, I have this error message. Why?
1
vote
0answers
308 views

QGIS Plugin Import Error on QGIS start

I have been getting a bit of an odd error when starting QGIS concerning the loading of one of my own plugins Traceback (most recent call last): File "G:/OSGEO4~1/apps/qgis/./python\qgis\utils.py", ...