Notification messages shown when software fails.

learn more… | top users | synonyms

0
votes
1answer
271 views

Unknown Error? - A Column was specified that does not exist

shps = [(shp1,"field1"), (shp2,"field2")] for item in shps: shp = item[0] field = item[1] for row in arcpy.SearchCursor(shp, fields='"{0}"'.format(field)): if row == ...
1
vote
3answers
250 views

Python says my shapefile does not exist. Why?

I'm working on a script that prints the names of hospitals that are within a certain zip-code. When I run my code, though, python keeps giving me an Error message that says that my Hospitals shapefile ...
0
votes
0answers
67 views

ZeroDivisionError

I was conducting Mean Coodinates process functions with weighted fields when I began faces ZeroDivision errors in some processes. The Shapefile Data has been joined together with imported Spreadsheet ...
2
votes
2answers
333 views

Running LAStools on QGIS 2.8: “missing dependency. lastools folder is not configured”

To be honest I'm not sure how to run LAStools from within QGIS 2.8. I'm trying to learn by experimentation. QGIS shows all the LAStools in the toolbox If I double click on a LAStool in the toolbox I ...
1
vote
2answers
207 views

Cartodb - Error: sql is read-only in NamedMaps

My map is not a named map. Map privacy is set to only people with the link. Why I I getting this error when trying to do queries? Has anyone else run into this?
0
votes
2answers
278 views

qgis2web python error message

Some times qgis2web pluggin does not work. I have this python error message: Ha ocurrido un error mientras se ejecutaba el código de Python: Traceback (most recent call last): File "C:/Users/u54202/...
1
vote
0answers
37 views

QGIS 2.8.1 running error

I am using QGIS 2.8.1-wein 32bin version. When running QGIS, It does not open. After displaying like below the picture, nothing happen. If you can solve this problem, please give me a solution. (I ...
2
votes
0answers
108 views

Data Upload Error for QGIS Cloud

I'm just taking a stab at QGIS Cloud to investigate it for a potential client, and I am pleased with the functionality of the web-viewer based on the sample maps. Although I cannot upload my own data. ...
3
votes
1answer
58 views

PostGIS - interfacing with CADCORP 7.1 and QGIS - user 'postgres' can import, but no other roles can

I'm new to PostGIS (reasonably) - but I'm plagued with one on-going problem: I'm able to access PostGIS from various GIS systems using the main 'postgres' user. Using a newly created user 'gis_viewer'...
0
votes
1answer
233 views

TypeError: value #0 - unsupported type: datetime.timedelta

The following code runs fine minus receiving the error below, which doesn't make any sense (to me) as I have other UpdateCursors and perform UpdateRow(row) with other date values. As can be seen below,...
0
votes
1answer
21 views

Hub Distance - 'Layer not found'

I am trying to calculate the distance between a polyline (River) and multiple points. However after installing the MMQGIS plugin and running a Hub Distance between the two layers the error comes up '...
0
votes
0answers
179 views

KMZ from QGIS wont display in Android Google Earth - Raster Images?

Trying to get a kmz working in the google earth android app.. works fine on google earth desktop.. I think maybe its because it has images in it? Any ideas? Error I get is Error: 1 Parse Error ...
1
vote
1answer
201 views

Error executing kriging in modelbuilder: 'invalid output extent'

I'm doing an interpolation using kriging in Modelbuilder, my model is this: Every time I run the model it says: ERROR 010092: Invalid output extent. Failed to execute (Kriging). Why does this ...
0
votes
1answer
34 views

Growing error from west to east when overlaying raster and shape

I am using a shape of Austria from gadm.org which I want to overlay with a netCDF file in R. As the netCDF has projected coordinates in EPSG:31287, I have reprojected the shape using FWtools and the ....
2
votes
1answer
302 views

How to open a “.sos” file without crashing QGIS?

I am trying to open a ".sos" file in QGIS. I have QGIS installed using OSGeo4W and added the gdal-sosi package. This should do the trick. But QGIS just shuts down when I try to open the file. It ...
-4
votes
1answer
406 views

Handling ArcPy locks in Python script?

i am writing script which uses different Tools of arcgis and implementing different functionalities .. My script consists in different Functions running in an order. Each function is connected to each ...
1
vote
1answer
92 views

ArcMap shutting down when I add rasters to a mosaic in foreground processing

I'm trying to add rasters to a mosaic - I was initially trying to do this by background processing but I was receiveing an error - I've followed the advice of this article (http://support.esri.com/en/...
1
vote
0answers
68 views

Is this error “invalid context…fatal error” due to GRASS GIS bug or the system?

Copy of error message that appears in the terminal (Macbook Pro, OS X 10.9.5): MacBook-Pro.local Python[2653] :CGContextRestoreGState: invalid context 0x0. This is a serious error. This ...
2
votes
1answer
595 views

What does number of shapes does not match the number of table records mean when trying to repair a data source?

I'm trying to repair a data source on arc from a .shp file. Every time I match it with the correct .shp file it display an error message stating "Number of shapes does not match the number of record ...
1
vote
0answers
413 views

Error when exporting individual pages from ArcGIS DDP

I'm working with a 52 page map book using data driven pages. I have used this before and haven't had any issues but I am currently getting an error message when I try and export individual pages. I ...
0
votes
1answer
202 views

Debugging AttributeError: 'Result' object has no attribute 'save' from ArcPy script?

I Keep getting this error message when i run the code below, can anyone tell me why? Error message: Traceback (most recent call last): File "C:\Python27\ArcGIS10.2\Lib\site-packages\pythonwin\...
2
votes
1answer
235 views

Error 4 in rasterizing a polygon shapefile

I'm using QGIS Wien 2.8.1 trying to convert a polygon shapefile to a raster, but I get the following error in a qgis-bin pop-up: ERROR 4: `' does not exist in the file system, and is not recognised ...
0
votes
0answers
388 views

java.lang.IllegalStateException: Form too large 326482>200000

I have a problem with Geoserver style creator! When I want upload a SLD file that I create it by QGIS I will see this error! Geoserver 2.6-SNAPSHOT, QGIS 2.8 HTTP ERROR 500 Problem accessing /...
2
votes
1answer
345 views

Unable to compile using make test in Linux

While trying to compile my test plugin I encounter this error, for the moment I can't figure out why, last week I had some issues on windows but eventually solved them via OSGeo Shell but this time ...
1
vote
2answers
295 views

Python Crashes when Running ArcPy's ExportToPDF(), ExportToPNG(), ExportToJPEG()

I am attempting to loop through a folder of ~400 .mxd's and save each to a .pdf in another folder. All tested arcpy.mapping export functions (pdf, jpeg & png) kill python without a chance to ...
0
votes
1answer
94 views

TopologyException error during fortify SpatialPolygonsDataFrame

I tried to reproduce a recent question on spatial data visualization using ggplot2 and received the following error message during fortify(world, region = "ISO3"): Error: TopologyException: Input ...
2
votes
1answer
271 views

gdal_calc works but I get a Python error at the end of each process

I have a problem while using gdal_calc by a .bat file. Here is the code : call "C:\OSGeo4w64\bin\o4w_env.bat" gdal_calc -A"D:\tuilage_script_1\tuilage\ndvi\4_810000_6370000_820000_6360000_ndvi....
1
vote
2answers
434 views

In-line variable %Name% problem in Model Builder

Having a problem with the inline variable structure of %Name%. Attached is my model builder program. I want to be able to take the Name of the file (which is produced as a variable in the iterate ...
3
votes
1answer
570 views

Processing plugin Python error on startup of QGIS 2.8.1

I've been running QGIS with no issues for several versions now, but after I upgraded to 2.8.1 Wien I had trouble running two plugins: qgis2leaf (which I believe depends on Processing) and Processing. ...
1
vote
0answers
149 views

Suppress verbose output when something goes wrong with ogr2ogr

Whenever ogr2ogr is not able to read a file, it seems to produce pages of output: Unable to open datasource `file.geojson' with the following drivers. -> ESRI Shapefile -> MapInfo File -&...
0
votes
1answer
110 views

Python error in search cursor function

I need to access the dbf file to extract variable list (i.e. "CODE"). Basically I am calling dbf file to allMamrows variable and then I am appending using for loop. On running the script I am getting ...
1
vote
2answers
92 views

QGIS GEarthView plugin ReactorAlreadyInstalledError

I've been battling to get this really handy plugin working for some time. When I try installing it from plugin manager, I get the following error: "This plugin is broken 'module' object has no ...
0
votes
0answers
96 views

How to add vector layer in Open Geo Suite?

Plugin for the add vector layer:- OpenLayers.Layer.Vector = OpenLayers.Class(OpenLayers.Layer, { isBaseLayer: !1, isFixed: !1, features: null, filter: null, selectedFeatures: null, ...
1
vote
0answers
500 views

QGIS Plugin Import Error on QGIS start

I have been getting a bit of an odd error when starting QGIS concerning the loading of one of my own plugins Traceback (most recent call last): File "G:/OSGEO4~1/apps/qgis/./python\qgis\utils.py", ...
2
votes
1answer
44 views

Feature Rotation Exception

I am getting an error when I try to change the value of a feature's Rotation Value. I have a schematic feature that I would like to rotate by changing the field's ROTATION value, but everytime I try ...
1
vote
0answers
77 views

Reading L1B ASTER in GRASS using r.in.aster

I'm having a problem getting an ASTER L1B to be read in GRASS using r.in.aster. The output the command shows this: (Wed Apr 8 17:49:03 2015) Command finished (1 sec) (Wed Apr 8 17:49:37 2015) ...
0
votes
1answer
255 views

Installing pgrouting on mac os x

Regarding installing (build) pgrouting I could install pgrouting-2.0.0 by using a command brew install pgrouting and following this Build manual: http://docs.pgrouting.org/2.0/en/doc/src/installation/...
1
vote
0answers
171 views

Unable to delineate inundation map from HEC-RAS to Hec-GeoRAS?

I am trying to delineate the flood map generated from HEC-RAS by importing them into the HEC-GeoRAS. However, I got this error: How will I resolve this?
0
votes
1answer
168 views

Geometric Network Build Error

I'm trying to create a geometric network of pipes, sewer structures (points) and manholes (points) inside a of an SDE. I can create the network in a file geodatabase but when I try creating it inside ...
1
vote
2answers
247 views

Erdas Imagine Error: Performance warning: Covariance calculation requires stack processing but input layer stack isn't suitable. How to solve it?

I am collecting signatures right now and when I am adding them to the Signature Editor Erdas says: Performance warning: Covariance calculation requires stack processing but input layer stack ...
0
votes
0answers
50 views

Error of memory for vector allocation while kriging [duplicate]

When I run the krige.conv function from the geoR package in R: kc <- krige.conv(as.geo,loc=prd.loc,krige=krige.control(cov.pars=c(0.29,0.79))) it throws me the following error: Error: cannot ...
0
votes
0answers
273 views

Failed to execute (ExtractByMask)

I use ExtractByMask of arcpy to isolate to subset the provinces of the Philippines. I do it with this code. import arcpy from arcpy import env from arcpy.sa import * arcpy.CheckOutExtension("Spatial")...
1
vote
1answer
208 views

QGIS georeferencer: Thin Plate Spline (TPS) residual

1) Is anyone able to explain in simple manner what does mean error exactly mean? I use metric values, so suppose 3.64109 is expression of meters and "e" is mathematical constant: http://en.wikipedia....
1
vote
1answer
269 views

how to fix this ERROR: Start vertex was not found

I am attempting to make an SQL selection but receive an error. My statement: SELECT * FROM network JOIN (SELECT * FROM shortest_path(' SELECT gid AS id, start_id::int4 AS source, end_id::int4 ...
1
vote
0answers
129 views

Trimble GeoXH Geoexplorer 2008 COM1 problem

I am using TerraSync and getting an error: GPS: The COM port is already configured for use by another device. Does anyone know how to correct this so I can start using my bluetooth connection ...
2
votes
1answer
177 views

TIN Interpolation in QGIS creates weird lines?

I am using TIN Interpolation to interpolate point features based on their cost attribute (value is between 0 and 5000). Graduated symbology creates something like this: However when I am using TIN ...
3
votes
1answer
187 views

QGIS Modeler flexibility and errors?

I'm trying to build a simple multi-step selection (by attribute) with the QGIS Modeler. I created a simple sample layer to avoid data-driven errors. Now I want to query the layer and select features 1)...
1
vote
2answers
413 views

Can't compile plugin builder plugin in QGIS 2.4 (Windows)

I'm trying to build a basic plugin using plugin builder but I can't even compile it. I tried following a few tutorials and just trying to compile whatever but that always results in the same problem. ...
1
vote
1answer
237 views

ArcGIS error: Unable to save edits. Raster dataset already exists

When I edit my attribute table then try to save edits an error message appears on my screen: "Unable to save edits. Raster dataset already exist." Why does this error message appear? My table of ...
3
votes
0answers
1k views

An Error Has Occurred Running Scripts On This Page - Repairing issue with batch script? [duplicate]

If you've been using ArcGIS for a while, you will have most likely come across this error: The issue is linked to some sort of ActiveX plugin security setting in the 32 bit version of Internet ...