Notification messages shown when software fails.

learn more… | top users | synonyms

2
votes
1answer
198 views

Error printing pdf in OpenGeo Suite client SDK app

I am using OpenGeo Suite 3.0.2. I created an app using Client SDK and stored the raster and vector data on postgreSQL/PostGIS. The print tool is not working, giving error the following error: ...
2
votes
1answer
146 views

Python Error while installing Cartogram

I am quite new to GIS and qGIS especially. I would like to install cfarmers cartogram plugin. From what I understand, this has to be done manually - so I 've followed the instructions from ...
1
vote
0answers
18 views

QGIS shuts down when I try to open a “.sos” file

I am trying to open a ".sos" file in QGIS. I have QGIS installed using OSGeo4W and added the gdal-sosi package. This should do the trick. But QGIS just shuts down when I try to open the file. It ...
-4
votes
1answer
60 views

Python script working incorrectly?

i am writing script which uses different Tools of arcgis and implementing different functionalities .. My script consists in different Functions running in an order. Each function is connected to ...
1
vote
1answer
23 views

ArcMap shutting down when I add rasters to a mosaic in foreground processing

I'm trying to add rasters to a mosaic - I was initially trying to do this by background processing but I was receiveing an error - I've followed the advice of this article ...
2
votes
2answers
2k views

Qgis - Couldn't load plugin 'processing' - name 'QsciLexerCustom' is not defined - Manjaro

UPDATED I receive the following error when I start Qgis: Couldn't load plugin 'processing' from ['/usr/share/qgis/python', '/home/v/.qgis2/python', '/home/v/.qgis2/python/plugins', ...
0
votes
1answer
191 views

How to solve sqlite_rtree_geometry_callback error?

I have just installed qgis 1.8 and it show error message the procedure entry point sqlite3_rtree_geometry_callback could not be located in the dynamic link library sqlite3.dll How to fix ...
0
votes
2answers
142 views

How to avoid snapping errors in QGis?

I am using QGis version 2.2.0 and I set the snapping option to the vertex, with a tolerance of 1.5 meter. When I draw a new polygon next to an old one, it seems like the vertices are automatically ...
2
votes
2answers
1k views

Script error searching for tools in ArcGIS 10.2.1 search window

Until I tried installing Visual Studio 6.0 and Crystal Reports 8.5 last week, my ArcGIS was working perfectly. After the installation, however, every time I try to execute any search in the search ...
5
votes
2answers
430 views

Skip errors in ModelBuilder?

is there a way to handle an error within the ArcGIS ModelBuilder? I have a model which iterates over hundreds of raster files. some of them may be corrupt. i`m looking for a way in which the ...
0
votes
0answers
14 views

Is this error “invalid context…fatal error” due to GRASS GIS bug or the system?

Copy of error message that appears in the terminal (Macbook Pro, OS X 10.9.5): MacBook-Pro.local Python[2653] :CGContextRestoreGState: invalid context 0x0. This is a serious error. This ...
2
votes
1answer
23 views

What does number of shapes does not match the number of table records mean when trying to repair a data source?

I'm trying to repair a data source on arc from a .shp file. Every time I match it with the correct .shp file it display an error message stating "Number of shapes does not match the number of record ...
0
votes
0answers
23 views

Error when exporting individual pages from ArcGIS DDP

I'm working with a 52 page map book using data driven pages. I have used this before and haven't had any issues but I am currently getting an error message when I try and export individual pages. I ...
0
votes
1answer
24 views

Debugging AttributeError: 'Result' object has no attribute 'save' from ArcPy script?

I Keep getting this error message when i run the code below, can anyone tell me why? Error message: Traceback (most recent call last): File ...
2
votes
2answers
264 views

Driver Error : DTM to Raster using GDAL_GRID

I am looking to interpolate a DTM (eventually over 4,000 DTMs) that is in a personal geodatabase format. I would like to do this in as few step as possible, eventually writing a batch script to do ...
0
votes
0answers
27 views

ArcGIS Model Builder ERROR 000210 — throwing random errors on multiple tools

Has anyone seen a problem like this, where ERROR 000210 occurs in ModelBuilder, seemingly at random, on one of two different tools (described below)? I am running a ModelBuilder model that I have run ...
2
votes
1answer
53 views

TIN Interpolation in QGIS creates weird lines?

I am using TIN Interpolation to interpolate point features based on their cost attribute (value is between 0 and 5000). Graduated symbology creates something like this: However when I am using TIN ...
0
votes
1answer
34 views

Error 4 in rasterizing a polygon shapefile

I'm using QGIS Wien 2.8.1 trying to convert a polygon shapefile to a raster, but I get the following error in a qgis-bin pop-up: ERROR 4: `' does not exist in the file system, and is not recognised ...
0
votes
0answers
35 views

Qgis 2.8, gdal python scripts gives error at end of process

I am using Qgis 2.8.1 64-bit (Standalone installer) which also packages a number or other applications, like OSGeo4W Shell, Saga GIS et.c. In the OSGeo4W Shell I am encountering a problem with some ...
0
votes
1answer
651 views

ArcPy SelectLayerByAttribute Error and how to control GP output layer name

I have a rather long script that first references an SDE feature class (non-versioned) to perform an attribute selection based on a SQL selection. I've been unable to figure out why the script will ...
3
votes
1answer
257 views

Getting Script Error has occurred in script on this page when running polygon to raster conversion?

i keep getting the script error problem every time i try using polygon to raster tool in ArcGIS 10.1. Please help me how I can solve this? screenshot embedded
2
votes
1answer
20 views

Unable to compile using make test in Linux

While trying to compile my test plugin I encounter this error, for the moment I can't figure out why, last week I had some issues on windows but eventually solved them via OSGeo Shell but this time ...
0
votes
0answers
12 views

java.lang.IllegalStateException: Form too large 326482>200000

I have a problem with Geoserver style creator! When I want upload a SLD file that I create it by QGIS I will see this error! Geoserver 2.6-SNAPSHOT, QGIS 2.8 HTTP ERROR 500 Problem accessing ...
0
votes
1answer
332 views

How to upload a list of 5-digit zip codes to CartoDB?

I'm playing around with the free version of CartoDB right now. Trying to upload both a CSV and Excel document with a list of 5-digit zip codes. I have received a "there was a problem georeferencing ...
1
vote
2answers
140 views

GDAL Application crashes when loading GDAL drivers

I'm developing on QT an application that uses GDAL library (which I compiled using MinGW 4.8). When I use the application on my windows 8 laptop, it works fine, but when I tried using it on several ...
2
votes
1answer
97 views

Processing plugin Python error on startup of QGIS 2.8.1

I've been running QGIS with no issues for several versions now, but after I upgraded to 2.8.1 Wien I had trouble running two plugins: qgis2leaf (which I believe depends on Processing) and Processing. ...
0
votes
1answer
134 views

error invalid output extend in zonal statistic

i have a problem with arcmap10.2...i have a dtm(that now has dimension of the pixel 1000) and another raster whit the same resolution with the code of a specific area..what i want to do is calculate ...
0
votes
2answers
55 views

Python Crashes when Running ArcPy's ExportToPDF(), ExportToPNG(), ExportToJPEG()

I am attempting to loop through a folder of ~400 .mxd's and save each to a .pdf in another folder. All tested arcpy.mapping export functions (pdf, jpeg & png) kill python without a chance to ...
0
votes
1answer
18 views

TopologyException error during fortify SpatialPolygonsDataFrame

I tried to reproduce a recent question on spatial data visualization using ggplot2 and received the following error message during fortify(world, region = "ISO3"): Error: TopologyException: Input ...
2
votes
1answer
54 views

Gdal_calc works but I get a pyhon error at the end of each process

I have a problem while using gdal_calc by a .bat file. Here is the code : call "C:\OSGeo4w64\bin\o4w_env.bat" gdal_calc ...
3
votes
2answers
3k views

How to fix python ImportError: DLL load failed: The specified module could not be found?

During import fiona, I am getting following error. Error is different from other user so I asked this question may be it is repeated. import fiona Traceback (most recent call last): File ...
1
vote
2answers
65 views

Can't compile plugin builder plugin in QGIS 2.4 (Windows)

I'm trying to build a basic plugin using plugin builder but I can't even compile it. I tried following a few tutorials and just trying to compile whatever but that always results in the same problem. ...
2
votes
1answer
232 views

Why is local hosting of ArcGIS Online webmap giving error?

I have been trying to locally host this webmap I created using AGOL (to modify it): http://dpwh.maps.arcgis.com/apps/MapTour/index.html?appid=7bd06d8330254b2688577d82f81bb92e It uses the Map Tour ...
0
votes
1answer
127 views

Selecting a valid format file

There has been an error when uploading a shapefile I want to start with some imported data. Upload a file. Please, select a valid format file # when upload a zip file: Oops! There has been an ...
1
vote
0answers
26 views

QGIS GEarthView plugin ReactorAlreadyInstalledError

I've been battling to get this really handy plugin working for some time. When I try installing it from plugin manager, I get the following error: "This plugin is broken 'module' object has no ...
1
vote
1answer
278 views

Reclassify says Unique values cannot be obtained from raster, using values from dialog?

I am using ArcGIS 10.2. Whenever I reclassify a raster layer I get the following message:"Unique values cannot be obtained from raster, using values from dialog". This does not prevent be from ...
1
vote
2answers
35 views

In-line variable %Name% problem in Model Builder

Having a problem with the inline variable structure of %Name%. Attached is my model builder program. I want to be able to take the Name of the file (which is produced as a variable in the iterate ...
2
votes
1answer
89 views

Are latitude and longitude observations independent of each other or correlated?

I want to develop a bivariate gaussian kernel in order to handle the random noise in my GPS tracks where each point has three parameters (lat, long and time stamp). I was wondering if latitude and ...
1
vote
0answers
40 views

Suppress verbose output when something goes wrong with ogr2ogr

Whenever ogr2ogr is not able to read a file, it seems to produce pages of output: Unable to open datasource `file.geojson' with the following drivers. -> ESRI Shapefile -> MapInfo File ...
0
votes
0answers
22 views

Failed to create feature dataset error

I am trying to create a feature dataset in a FILEGDB to create topology rules. However when I try to create a dataset it gives me this error. Failed to create the feature dataset. FDO error: ...
1
vote
1answer
134 views

GeoDjango error: Only numeric values of degree units are allowed on geographic DWithin queries

I'm trying to get N points within 5000 meters of a certain point. My database is Postgres(PostGIS). I have a model like this: class Theatre(models.Model): geom = models.PointField(srid=4326, ...
2
votes
3answers
439 views

Raster map in different zone () than region ()

I am new to QGIS (just installed QGIS 2.0.1) and am having problems running any spatial analysis tools. I followed the instructions on how to call GRASS tools into QGIS, but when I try to run the ...
1
vote
3answers
95 views

Why do I get an error message at QGIS training manual 3.3?

I have a problem following the QGIS training manual lesson 3.3 (Ratio Classification). You have to add a column to an SQlite layer. The new column is AREA. I followed the instructions and added it as ...
0
votes
1answer
27 views

Python error in search cursor function

I need to access the dbf file to extract variable list (i.e. "CODE"). Basically I am calling dbf file to allMamrows variable and then I am appending using for loop. On running the script I am getting ...
4
votes
1answer
1k views

Packaging Error - General function failure

Have some problems with sharing my map on ArcGIS Online: As a student, I am now working with my master thesis and I use ArcGIS Online as a workflow based sharing network. I work locally on my ...
0
votes
0answers
26 views

qgis raster calculator unexpected type long

I am trying to do a very simple multiplication of a raster using the QGIS raster calculator but repeatedly receive the following error: Traceback (most recent call last): File ...
0
votes
0answers
34 views

Is Images Concatenation in the Processing toolbox working in QGIS 2.8?

I want to make a single multiband .tiff image out of 7 bands that I have downloaded from USGS Earth Explorer and for that I used images concatination in the processing toolbox. I have loaded the 7 ...
0
votes
0answers
27 views

How to add vector layer in Open Geo Suite?

Plugin for the add vector layer:- OpenLayers.Layer.Vector = OpenLayers.Class(OpenLayers.Layer, { isBaseLayer: !1, isFixed: !1, features: null, filter: null, selectedFeatures: null, ...
0
votes
0answers
27 views

Command Grass in QGIS not work

When I use r.contour or other Grass commands in QGis, I have this error message. Why?
1
vote
0answers
47 views

QGIS Plugin Import Error on QGIS start

I have been getting a bit of an odd error when starting QGIS concerning the loading of one of my own plugins Traceback (most recent call last): File "G:/OSGEO4~1/apps/qgis/./python\qgis\utils.py", ...